BDBM95038 2-[(2-fluorobenzoyl)thiocarbamoylamino]-4-methyl-thiazole-5-carboxylic acid methyl ester::2-[[[[(2-fluorophenyl)-oxomethyl]amino]-sulfanylidenemethyl]amino]-4-methyl-5-thiazolecarboxylic acid methyl ester::MLS000681438::SMR000269116::cid_1336265::methyl 2-({[(2-fluorobenzoyl)amino]carbonothioyl}amino)-4-methyl-1,3-thiazole-5-carboxylate::methyl 2-[(2-fluorobenzoyl)carbamothioylamino]-4-methyl-1,3-thiazole-5-carboxylate::methyl 2-[(2-fluorophenyl)carbonylcarbamothioylamino]-4-methyl-1,3-thiazole-5-carboxylate
SMILES COC(=O)c1sc(NC(=S)NC(=O)c2ccccc2F)nc1C
InChI Key InChIKey=FLEXWLOYXRDOGU-UHFFFAOYSA-N
Data  2 IC50
  Tab Delimited (TSV)   2D SDfile   Computed 3D by Vconf -m prep SDfile
Find this compound or compounds like it in BindingDB:
Activity Spreadsheet -- Enzyme Inhibition Constant Data from BindingDB
Found 2 hits for monomerid = 95038
TargetLow molecular weight phosphotyrosine protein phosphatase(Homo sapiens (Human))
Burnham Center For Chemical Genomics
Curated by PubChem BioAssay
LigandPNGBDBM95038(2-[(2-fluorobenzoyl)thiocarbamoylamino]-4-methyl-t...)
Affinity DataIC50: >8.00E+4nM
In DepthDetails PCBioAssay
TargetLow molecular weight phosphotyrosine protein phosphatase(Homo sapiens (Human))
Burnham Center For Chemical Genomics
Curated by PubChem BioAssay
LigandPNGBDBM95038(2-[(2-fluorobenzoyl)thiocarbamoylamino]-4-methyl-t...)
Affinity DataIC50: >8.00E+4nM
In DepthDetails PCBioAssay